BDBM50062954 ((1S,2S,4S)-1-Benzyl-2-hydroxy-4-{2-[3-isobutyl-3-(2-isopropyl-thiazol-4-ylmethyl)-ureido]-acetylamino}-5-phenyl-pentyl)-carbamic acid thiazol-5-ylmethyl ester::CHEMBL155636
SMILES CC(C)CN(Cc1csc(n1)C(C)C)C(=O)NCC(=O)N[C@H](C[C@H](O)[C@H](Cc1ccccc1)NC(=O)OCc1cncs1)Cc1ccccc1
InChI Key InChIKey=PUHGSQFKLZKRNV-LENAEUCASA-N
Data  1 IC50
  Tab Delimited (TSV)   2D SDfile   Computed 3D by Vconf -m prep SDfile
Find this compound or compounds like it in BindingDB:
Activity Spreadsheet -- Enzyme Inhibition Constant Data from BindingDB
Found 1 hit for monomerid = 50062954
TargetGag-Pol polyprotein [489-587](Human immunodeficiency virus type 1)
Abbott Laboratories
Curated by ChEMBL
LigandPNGBDBM50062954(((1S,2S,4S)-1-Benzyl-2-hydroxy-4-{2-[3-isobutyl-3-...)
Affinity DataIC50:  1.60nM. Assay description: Inhibitory concentration against purified recombinant HIV-1 protease using fluorogenic substrate
In DepthDetails ArticlePubMed