BDBM50062981 CHEMBL3397998
SMILES CC(=O)N1CCC(CC1)C(=O)N(CCCN1CCCN(Cc2ccc(F)cc2)CC1)c1ccc(C)c(Cl)c1
InChI Key InChIKey=AOCCUSCVPQOIRN-UHFFFAOYSA-N
Data  1 IC50
  Tab Delimited (TSV)   2D SDfile   Computed 3D by Vconf -m prep SDfile
Find this compound or compounds like it in BindingDB:
Activity Spreadsheet -- Enzyme Inhibition Constant Data from BindingDB
Found 1 hit for monomerid = 50062981
TargetC-C chemokine receptor type 5(Homo sapiens (Human))
Zhejiang University
Curated by ChEMBL
LigandPNGBDBM50062981(CHEMBL3397998)
Affinity DataIC50:  906nM. Assay description: Antagonist activity against CCR5 (unknown origin) expressed in CHO cells co-expressing Galpha16 incubated for 10 mins assessed as inhibition of RANTE...
In DepthDetails ArticlePubMed