BDBM50063032 ((1S,3S,4S)-1-Benzyl-4-{3-[3-cyclopropyl-3-(2-isopropyl-thiazol-4-ylmethyl)-ureido]-propionylamino}-3-hydroxy-5-phenyl-pentyl)-carbamic acid thiazol-5-ylmethyl ester::CHEMBL158358
SMILES CC(C)c1nc(CN(C2CC2)C(=O)NCCC(=O)N[C@@H](Cc2ccccc2)[C@@H](O)C[C@H](Cc2ccccc2)NC(=O)OCc2cncs2)cs1
InChI Key InChIKey=MNDNWXNRVPYSDS-RMFXYIPJSA-N
Data  1 IC50
  Tab Delimited (TSV)   2D SDfile   Computed 3D by Vconf -m prep SDfile
Find this compound or compounds like it in BindingDB:
Activity Spreadsheet -- Enzyme Inhibition Constant Data from BindingDB
Found 1 hit for monomerid = 50063032
TargetGag-Pol polyprotein [489-587](Human immunodeficiency virus type 1)
Abbott Laboratories
Curated by ChEMBL
LigandPNGBDBM50063032(((1S,3S,4S)-1-Benzyl-4-{3-[3-cyclopropyl-3-(2-isop...)
Affinity DataIC50:  73nM. Assay description: Inhibitory concentration against purified recombinant HIV-1 protease using fluorogenic substrate
In DepthDetails ArticlePubMed