BDBM50063052 CHEMBL3398143
SMILES CC(=O)c1ccccc1NS(=O)(=O)c1ccc(OC(=O)C(C)(C)C)cc1
InChI Key InChIKey=AOYZKUMTEYCRDS-UHFFFAOYSA-N
Data  3 IC50
  Tab Delimited (TSV)   2D SDfile   Computed 3D by Vconf -m prep SDfile
Find this compound or compounds like it in BindingDB:
Activity Spreadsheet -- Enzyme Inhibition Constant Data from BindingDB
Found 3 hits for monomerid = 50063052
TargetNeutrophil elastase(Homo sapiens (Human))
Chang Gung University
Curated by ChEMBL
LigandPNGBDBM50063052(CHEMBL3398143)
Affinity DataIC50:  110nM. Assay description: Inhibition of Pr3 (unknown origin) using t-butyloxycarbonyl-Ala-Ala-Nva-thiobenzyl ester as substrate measured for 180 mins by spectrophotometry
In DepthDetails ArticlePubMed
TargetCathepsin G(Homo sapiens (Human))
Chang Gung University
Curated by ChEMBL
LigandPNGBDBM50063052(CHEMBL3398143)
Affinity DataIC50: >1.00E+4nM. Assay description: Inhibition of human cathepsin G using N-succinyl-Ala-Ala-Pro-Phe-p-nitroanilide as substrate measured for 180 mins by spectrophotometry
In DepthDetails ArticlePubMed
TargetMyeloblastin(Homo sapiens (Human))
Chang Gung University
Curated by ChEMBL
LigandPNGBDBM50063052(CHEMBL3398143)
Affinity DataIC50:  470nM. Assay description: Inhibition of Pr3 (unknown origin) using t-butyloxycarbonyl-Ala-Ala-Nva-thiobenzyl ester as substrate measured for 180 mins by spectrophotometry
In DepthDetails ArticlePubMed