BDBM50063514 CHEMBL3398504
SMILES [#8]-[#6](=O)C(F)(F)F.[H][C@@]1([#6]-[#6]-[#6]-[#7]1-[#6]-[#6]\[#6]=[#6](/c1ccccc1)-c1ccccc1)[#6@@H](-[#7])-[#6](-[#8])=O
InChI Key InChIKey=FKUPOQLQJDQIOV-NHCUHLMSSA-N
Data  3 IC50
  Tab Delimited (TSV)   2D SDfile   Computed 3D by Vconf -m prep SDfile
Find this compound or compounds like it in BindingDB:
Activity Spreadsheet -- Enzyme Inhibition Constant Data from BindingDB
Found 3 hits for monomerid = 50063514
TargetSodium- and chloride-dependent GABA transporter 1(Rattus norvegicus)
Ludwig-Maximilians-Universit£T M£Nchen
Curated by ChEMBL
LigandPNGBDBM50063514(CHEMBL3398504)
Affinity DataIC50:  4.90E+4nM. Assay description: Inhibition of mouse GAT1 expressed in HEK293 cells by [3H]GABA uptake assay
In DepthDetails ArticlePubMed
TargetSodium-dependent serotonin transporter(MOUSE)
Ludwig-Maximilians-Universit£T M£Nchen
Curated by ChEMBL
LigandPNGBDBM50063514(CHEMBL3398504)
Affinity DataIC50:  1.74E+4nM. Assay description: Inhibition of mouse GAT4 expressed in HEK293 cells by [3H]GABA uptake assay
In DepthDetails ArticlePubMed
TargetSodium-dependent dopamine transporter(MOUSE)
Ludwig-Maximilians-Universit£T M£Nchen
Curated by ChEMBL
LigandPNGBDBM50063514(CHEMBL3398504)
Affinity DataIC50:  1.15E+4nM. Assay description: Inhibition of mouse GAT3 expressed in HEK293 cells by [3H]GABA uptake assay
In DepthDetails ArticlePubMed