BDBM50063754 CHEMBL3397342
SMILES Cc1cn(Cc2ccc(O)c(c2)C(C)(C)C)c2ccc(OCC(O)=O)cc12
InChI Key InChIKey=UUSGOCUCTMEHCS-UHFFFAOYSA-N
Data  2 KI
  Tab Delimited (TSV)   2D SDfile   Computed 3D by Vconf -m prep SDfile
Find this compound or compounds like it in BindingDB:
Activity Spreadsheet -- Enzyme Inhibition Constant Data from BindingDB
Found 2 hits for monomerid = 50063754
TargetThyroid hormone receptor beta(Homo sapiens (Human))
Eli Lilly
Curated by ChEMBL
LigandPNGBDBM50063754(CHEMBL3397342)
Affinity DataKi:  0.300nM. Assay description: Displacement of [125I]-L-3,5,3'-triiodothyronine from human TRbeta expressed in human Hela cell lysate measured after overnight incubation by competi...
In DepthDetails ArticlePubMed
TargetThyroid hormone receptor alpha(Homo sapiens (Human))
Eli Lilly
Curated by ChEMBL
LigandPNGBDBM50063754(CHEMBL3397342)
Affinity DataKi:  10nM. Assay description: Displacement of [125I]-L-3,5,3'-triiodothyronine from human TRalpha expressed in human Hela cell lysate measured after overnight incubation by compet...
In DepthDetails ArticlePubMed