BDBM50064066 2-[3-(Benzothiazol-2-ylmethoxy)-phenyl]-6-bromo-4-oxo-4H-chromene-8-carboxylic acid::CHEMBL287559
SMILES OC(=O)c1cc(Br)cc2c1oc(cc2=O)-c1cccc(OCc2nc3ccccc3s2)c1
InChI Key InChIKey=BZNPRZMJMTTYCW-UHFFFAOYSA-N
Data  1 Kd
  Tab Delimited (TSV)   2D SDfile   Computed 3D by Vconf -m prep SDfile
Find this compound or compounds like it in BindingDB:
Activity Spreadsheet -- Enzyme Inhibition Constant Data from BindingDB
Found 1 hit for monomerid = 50064066
TargetCysteinyl leukotriene receptor 1(GUINEA PIG)
Vrije Universiteit
Curated by ChEMBL
LigandPNGBDBM50064066(2-[3-(Benzothiazol-2-ylmethoxy)-phenyl]-6-bromo-4-...)
Affinity DataKd:  79nM. Assay description: In vitro affinity for CysLT1 receptors on guinea pig lung membranes, measured by displacement of [3H]-LTD4.
In DepthDetails ArticlePubMed