BDBM50064093 (7S,10S)-10-Hydroxymethyl-7-isopropyl-4,4,6-trimethyl-2,3,4,6,7,9,10,11-octahydro-1H-6,9-diaza-cycloocta[b]naphthalen-8-one::CHEMBL37684
SMILES CC(C)[C@@H]1N(C)c2cc3c(CCCC3(C)C)cc2C[C@@H](CO)NC1=O
InChI Key InChIKey=JASZPZPNYHJPQY-LPHOPBHVSA-N
Data  1 KI
  Tab Delimited (TSV)   2D SDfile   Computed 3D by Vconf -m prep SDfile
Find this compound or compounds like it in BindingDB:
Activity Spreadsheet -- Enzyme Inhibition Constant Data from BindingDB
Found 1 hit for monomerid = 50064093
TargetProtein kinase C delta type(Homo sapiens (Human))
University Of Tokyo
Curated by ChEMBL
LigandPNGBDBM50064093((7S,10S)-10-Hydroxymethyl-7-isopropyl-4,4,6-trimet...)
Affinity DataKi:  65nM. Assay description: Displacement of [3H]-PDBu from recombinant Protein kinase C delta
In DepthDetails ArticlePubMed