BDBM50064392 CHEMBL3403716
SMILES Cc1c2CCOc3cc(ccc3-n2c2CC(C)(C)CC(=O)c12)C(N)=O
InChI Key InChIKey=CXFXSTHDYJQJAP-UHFFFAOYSA-N
Data  1 KI
PDB links: 1 PDB ID matches this monomer.
  Tab Delimited (TSV)   2D SDfile   Computed 3D by Vconf -m prep SDfile
Find this compound or compounds like it in BindingDB:
Activity Spreadsheet -- Enzyme Inhibition Constant Data from BindingDB
Found 1 hit for monomerid = 50064392
TargetHeat shock protein HSP 90-alpha(Homo sapiens (Human))
Vertex Pharmaceuticals
Curated by ChEMBL
LigandPNGBDBM50064392(CHEMBL3403716)
Affinity DataKi:  86nM. Assay description: Inhibition of FITC-GA binding to Hsp90alpha (unknown origin) ATPase site after 2 hrs by fluorescence polarization assay