BDBM50064409 CHEMBL2179367
SMILES CCCCCCCCCCCCCCCC[C@@H]1CC[P@@](=O)(OC)OC(C)=C1C(=O)OC
InChI Key InChIKey=LREDRRZRDNXREO-SLGOVJDISA-N
Data  1 IC50
  Tab Delimited (TSV)   2D SDfile   Computed 3D by Vconf -m prep SDfile
Find this compound or compounds like it in BindingDB:
Activity Spreadsheet -- Enzyme Inhibition Constant Data from BindingDB
Found 1 hit for monomerid = 50064409
TargetHormone-sensitive lipase(Rattus norvegicus (Rat))
University Of Missouri St. Louis
Curated by ChEMBL
LigandPNGBDBM50064409(CHEMBL2179367)
Affinity DataIC50:  6.00E+4nM. Assay description: Inhibition of rat hormone sensitive lipase assessed as oleic acid release from [3H]triolein by scintillation counting
In DepthDetails ArticlePubMed