BDBM50064415 CHEMBL3401166
SMILES [H][C@@]12COC(=O)C1=C(C)O[P@@](=O)(CC2)OCCCCCCCCCCCCCCCC
InChI Key InChIKey=SKWYYGFUDVULTB-YKGWIAGDSA-N
Data  1 IC50
  Tab Delimited (TSV)   2D SDfile   Computed 3D by Vconf -m prep SDfile
Find this compound or compounds like it in BindingDB:
Activity Spreadsheet -- Enzyme Inhibition Constant Data from BindingDB
Found 1 hit for monomerid = 50064415
TargetHormone-sensitive lipase(Rattus norvegicus (Rat))
University Of Missouri St. Louis
Curated by ChEMBL
LigandPNGBDBM50064415(CHEMBL3401166)
Affinity DataIC50:  6.90E+3nM. Assay description: Inhibition of rat hormone sensitive lipase assessed as oleic acid release from [3H]triolein by scintillation counting
In DepthDetails ArticlePubMed