BDBM50064417 4-Bromo-2,6-diisopropyl-phenol::CHEMBL54497
SMILES CC(C)c1cc(Br)cc(C(C)C)c1O
InChI Key InChIKey=QNJVELOLCDKQBN-UHFFFAOYSA-N
Data  2 EC50
  Tab Delimited (TSV)   2D SDfile   Computed 3D by Vconf -m prep SDfile
Find this compound or compounds like it in BindingDB:
Activity Spreadsheet -- Enzyme Inhibition Constant Data from BindingDB
Found 2 hits for monomerid = 50064417
TargetGABA A receptor alpha-1/beta-1/gamma-2(Homo sapiens (Human))
Università
Curated by ChEMBL
LigandPNGBDBM50064417(4-Bromo-2,6-diisopropyl-phenol | CHEMBL54497)
Affinity DataEC50:  1.20E+4nM. Assay description: Modulation of GABA-induced chloride currents in Xenopus laevis oocytes expressing human alpha-1beta1-gamma2 GABA-A receptor subunits
In DepthDetails ArticlePubMed
TargetGABA A receptor alpha-1/beta-1/gamma-2(Homo sapiens (Human))
Università
Curated by ChEMBL
LigandPNGBDBM50064417(4-Bromo-2,6-diisopropyl-phenol | CHEMBL54497)
Affinity DataEC50:  3.80E+4nM. Assay description: Direct activation of chloride current in Xenopus laevis oocytes expressing human alpha-1beta1-gamma2 GABA-A receptor subunits
In DepthDetails ArticlePubMed