BDBM50064420 (4-Hydroxy-3,5-diisopropyl-phenyl)-phenyl-methanone::CHEMBL298951
SMILES CC(C)c1cc(cc(C(C)C)c1O)C(=O)c1ccccc1
InChI Key InChIKey=RCAFIHRSMRKZLG-UHFFFAOYSA-N
Data  2 EC50
  Tab Delimited (TSV)   2D SDfile   Computed 3D by Vconf -m prep SDfile
Find this compound or compounds like it in BindingDB:
Activity Spreadsheet -- Enzyme Inhibition Constant Data from BindingDB
Found 2 hits for monomerid = 50064420
TargetGABA A receptor alpha-1/beta-1/gamma-2(Homo sapiens (Human))
Università
Curated by ChEMBL
LigandPNGBDBM50064420((4-Hydroxy-3,5-diisopropyl-phenyl)-phenyl-methanon...)
Affinity DataEC50:  9.00E+3nM. Assay description: Modulation of GABA-induced chloride currents in Xenopus laevis oocytes expressing human alpha-1beta1-gamma2 GABA-A receptor subunits
In DepthDetails ArticlePubMed
TargetGABA A receptor alpha-1/beta-1/gamma-2(Homo sapiens (Human))
Università
Curated by ChEMBL
LigandPNGBDBM50064420((4-Hydroxy-3,5-diisopropyl-phenyl)-phenyl-methanon...)
Affinity DataEC50:  4.70E+4nM. Assay description: Direct activation of chloride current in Xenopus laevis oocytes expressing human alpha-1beta1-gamma2 GABA-A receptor subunits
In DepthDetails ArticlePubMed