BDBM50064428 CHEMBL2179365
SMILES CCCCCCCCCCCCCCCCCC[C@@H]1CC[P@@](=O)(OC)OC(C)=C1C(=O)OC
InChI Key InChIKey=VRXYJHDZLJKPIN-INJOXJOKSA-N
Data  1 IC50
  Tab Delimited (TSV)   2D SDfile   Computed 3D by Vconf -m prep SDfile
Find this compound or compounds like it in BindingDB:
Activity Spreadsheet -- Enzyme Inhibition Constant Data from BindingDB
Found 1 hit for monomerid = 50064428
TargetHormone-sensitive lipase(Rattus norvegicus (Rat))
University Of Missouri St. Louis
Curated by ChEMBL
LigandPNGBDBM50064428(CHEMBL2179365)
Affinity DataIC50: >1.00E+5nM. Assay description: Inhibition of rat hormone sensitive lipase assessed as oleic acid release from [3H]triolein by scintillation counting
In DepthDetails ArticlePubMed