BDBM50064441 (2S,3R,4S)-3-Hydroxy-4-((4E,6E,12E,14Z)-(2R,3S,9S,10S,11R)-10-hydroxy-3,15-dimethoxy-7,9,11,13-tetramethyl-16-oxo-oxacyclohexadeca-4,6,12,14-tetraen-2-yl)-2-methyl-pentanoic acid::CHEMBL293082
SMILES CO[C@H]1\C=C\C=C(C)\C[C@H](C)[C@H](O)[C@H](C)\C=C(/C)\C=C(OC)\C(=O)O[C@@H]1[C@@H](C)[C@@H](O)[C@H](C)C(O)=O
InChI Key InChIKey=IJPJCRAUPZATAY-MQMGXAQVSA-N
Data  2 IC50
  Tab Delimited (TSV)   2D SDfile   Computed 3D by Vconf -m prep SDfile
Find this compound or compounds like it in BindingDB:
Activity Spreadsheet -- Enzyme Inhibition Constant Data from BindingDB
Found 2 hits for monomerid = 50064441
TargetV-type proton ATPase subunit S1(Homo sapiens (Human))
Smithkline Beecham
Curated by ChEMBL
LigandPNGBDBM50064441((2S,3R,4S)-3-Hydroxy-4-((4E,6E,12E,14Z)-(2R,3S,9S,...)
Affinity DataIC50: >1.00E+4nM. Assay description: Inhibition of V-ATPase-driven proton transport in membrane vesicles derived from chicken osteoclasts (cOc).
In DepthDetails ArticlePubMed
TargetV-type proton ATPase subunit S1(Homo sapiens (Human))
Smithkline Beecham
Curated by ChEMBL
LigandPNGBDBM50064441((2S,3R,4S)-3-Hydroxy-4-((4E,6E,12E,14Z)-(2R,3S,9S,...)
Affinity DataIC50: >1.00E+4nM. Assay description: Inhibition of V-ATPase-driven proton transport in membrane vesicles derived from bovine chromaffin granules (bCG).
In DepthDetails ArticlePubMed