BDBM50064648 CHEMBL3403771
SMILES COCC(C)Oc1ccc(cc1)[C@H](CO)NC(=O)[C@@H](C)c1ccccc1
InChI Key InChIKey=GJLPLESHKCHSHK-LQGBDCMISA-N
Data  1 EC50
  Tab Delimited (TSV)   2D SDfile   Computed 3D by Vconf -m prep SDfile
Find this compound or compounds like it in BindingDB:
Activity Spreadsheet -- Enzyme Inhibition Constant Data from BindingDB
Found 1 hit for monomerid = 50064648
TargetProbable G-protein coupled receptor 88(Homo sapiens (Human))
Bristol-Myers Squibb
Curated by ChEMBL
LigandPNGBDBM50064648(CHEMBL3403771)
Affinity DataEC50: >1.00E+4nM. Assay description: Agonist activity at GPR88 (unknown origin) transfected in forskolin-stimulated HEK cells assessed as inhibition of cAMP production after 30 mins by H...
In DepthDetails ArticlePubMed