BDBM50064766 CHEMBL3403795
SMILES OC[C@H](NC(=O)[C@@H]1C[C@@H]1c1ccccc1)c1ccc2ccccc2c1
InChI Key InChIKey=ZSCFETLRKPSUJK-NJYVYQBISA-N
Data  1 EC50
  Tab Delimited (TSV)   2D SDfile   Computed 3D by Vconf -m prep SDfile
Find this compound or compounds like it in BindingDB:
Activity Spreadsheet -- Enzyme Inhibition Constant Data from BindingDB
Found 1 hit for monomerid = 50064766
TargetProbable G-protein coupled receptor 88(Homo sapiens (Human))
Bristol-Myers Squibb
Curated by ChEMBL
LigandPNGBDBM50064766(CHEMBL3403795)
Affinity DataEC50: >8.10E+4nM. Assay description: Agonist activity at GPR88 (unknown origin) transfected in forskolin-stimulated HEK cells assessed as inhibition of cAMP production after 30 mins by H...
In DepthDetails ArticlePubMed