BDBM50064870 CHEMBL3401276
SMILES Cc1c(NC(=O)c2cnc(cn2)C(C)(C)C)cccc1-c1cn(C)c(=O)c(Nc2ccc(cc2)C(=O)N2CCOCC2)n1
InChI Key InChIKey=GFKTZGSMJNFNJY-UHFFFAOYSA-N
Data  2 IC50
  Tab Delimited (TSV)   2D SDfile   Computed 3D by Vconf -m prep SDfile
Find this compound or compounds like it in BindingDB:
Activity Spreadsheet -- Enzyme Inhibition Constant Data from BindingDB
Found 2 hits for monomerid = 50064870
TargetTyrosine-protein kinase BTK(Homo sapiens (Human))
Genentech
Curated by ChEMBL
LigandPNGBDBM50064870(CHEMBL3401276)
Affinity DataIC50:  70nM. Assay description: Inhibition of BTK (unknown origin) by Lanthascreen method
In DepthDetails ArticlePubMed
TargetTyrosine-protein kinase BTK(Mus musculus)
Genentech
Curated by ChEMBL
LigandPNGBDBM50064870(CHEMBL3401276)
Affinity DataIC50:  890nM. Assay description: Inhibition of BTK-mediated CD86 surface expression in Balb/c mouse splenocytes preincubated for 60 mins before F(ab')2 anti-mouse IgM measured after ...
In DepthDetails ArticlePubMed