BDBM50064912 CHEMBL77718::{1-[1-((S)-2-Hydroxy-1-isobutyl-octylcarbamoyl)-2-methyl-propylcarbamoyl]-2-methyl-propyl}-carbamic acid tert-butyl ester
SMILES CCCCCCC(O)[C@H](CC(C)C)NC(=O)C(NC(=O)C(NC(=O)OC(C)(C)C)C(C)C)C(C)C
InChI Key InChIKey=KTUDWPVXFIWEPN-LEISRSHCSA-N
Data  1 IC50
  Tab Delimited (TSV)   2D SDfile   Computed 3D by Vconf -m prep SDfile
Find this compound or compounds like it in BindingDB:
Activity Spreadsheet -- Enzyme Inhibition Constant Data from BindingDB
Found 1 hit for monomerid = 50064912
TargetPepsin A-5(Homo sapiens (Human))
Institute Of Pharmaceutical Chemistry
Curated by ChEMBL
LigandPNGBDBM50064912(CHEMBL77718 | {1-[1-((S)-2-Hydroxy-1-isobutyl-octy...)
Affinity DataIC50:  830nM. Assay description: Inhibitory activity against pepsin as oxidation of o-phenylenediamine by Horse radish peroxidase (Pepsin sensitive)
In DepthDetails ArticlePubMed