BDBM50065082 (4R,5S,6S,7R)-1-(4-Amino-benzyl)-4,7-dibenzyl-5,6-dihydroxy-3-(1H-indazol-5-ylmethyl)-[1,3]diazepan-2-one::CHEMBL311298
SMILES Nc1ccc(CN2[C@H](Cc3ccccc3)[C@H](O)[C@@H](O)[C@@H](Cc3ccccc3)N(Cc3ccc4[nH]ncc4c3)C2=O)cc1
InChI Key InChIKey=WYDHHVYLPYCAIL-FYZVQMPESA-N
Data  1 KI
  Tab Delimited (TSV)   2D SDfile   Computed 3D by Vconf -m prep SDfile
Find this compound or compounds like it in BindingDB:
Activity Spreadsheet -- Enzyme Inhibition Constant Data from BindingDB
Found 1 hit for monomerid = 50065082
TargetGag-Pol polyprotein [489-587](Human immunodeficiency virus type 1)
Dupont Pharmaceuticals
Curated by ChEMBL
LigandPNGBDBM50065082((4R,5S,6S,7R)-1-(4-Amino-benzyl)-4,7-dibenzyl-5,6-...)
Affinity DataKi:  0.0300nM. Assay description: Inhibitory activity against HIV protease
In DepthDetails ArticlePubMed