BDBM50065609 CHEMBL3401381
SMILES CCC(CC)CC1(O)CCN(CC1)C(=O)Nc1cc(Oc2ccc(F)cc2)cc(Oc2ccc(cc2)S(C)(=O)=O)c1
InChI Key InChIKey=SBXWRRBHODFQNS-UHFFFAOYSA-N
Data  5 IC50
  Tab Delimited (TSV)   2D SDfile   Computed 3D by Vconf -m prep SDfile
Find this compound or compounds like it in BindingDB:
Activity Spreadsheet -- Enzyme Inhibition Constant Data from BindingDB
Found 5 hits for monomerid = 50065609
TargetSphingosine 1-phosphate receptor 2(Homo sapiens (Human))
Ono Pharmaceutical
Curated by ChEMBL
LigandPNGBDBM50065609(CHEMBL3401381)
Affinity DataIC50:  58nM. Assay description: Antagonist activity at human S1P2 receptor overexpressed in CHO cells assessed as increase in intracellular calcium ion concentration incubated 3 min...
In DepthDetails ArticlePubMed
TargetLysophosphatidic acid receptor 1(Homo sapiens (Human))
Ono Pharmaceutical
Curated by ChEMBL
LigandPNGBDBM50065609(CHEMBL3401381)
Affinity DataIC50: >800nM. Assay description: Antagonist activity at human LPA1 receptor overexpressed in CHO cells assessed as increase in intracellular calcium ion concentration after 3 mins by...
In DepthDetails ArticlePubMed
TargetSphingosine 1-phosphate receptor 2(Homo sapiens (Human))
Ono Pharmaceutical
Curated by ChEMBL
LigandPNGBDBM50065609(CHEMBL3401381)
Affinity DataIC50:  45nM. Assay description: Displacement of [33P]-S1P from human S1P2 receptor expressed in CHOK1 cells after 60 mins by scintillation counting analysis
In DepthDetails ArticlePubMed
TargetLysophosphatidic acid receptor 2(Homo sapiens (Human))
Ono Pharmaceutical
Curated by ChEMBL
LigandPNGBDBM50065609(CHEMBL3401381)
Affinity DataIC50: >800nM. Assay description: Antagonist activity at human LPA2 receptor overexpressed in CHO cells assessed as increase in intracellular calcium ion concentration after 3 mins by...
In DepthDetails ArticlePubMed
TargetSphingosine 1-phosphate receptor 3(Homo sapiens (Human))
Ono Pharmaceutical
Curated by ChEMBL
LigandPNGBDBM50065609(CHEMBL3401381)
Affinity DataIC50: >800nM. Assay description: Antagonist activity at human S1P3 receptor overexpressed in CHO cells assessed as increase in intracellular calcium ion concentration after 3 mins by...
In DepthDetails ArticlePubMed