BDBM50065686 CHEMBL3404006
SMILES COc1ccc(Cn2c3nc(ncc3c(CCN3CCOCC3)cc2=O)N2CCC[C@H]2CO)cc1Cl
InChI Key InChIKey=NGXQGGDGQZUDRM-FQEVSTJZSA-N
Data  1 IC50
  Tab Delimited (TSV)   2D SDfile   Computed 3D by Vconf -m prep SDfile
Find this compound or compounds like it in BindingDB:
Activity Spreadsheet -- Enzyme Inhibition Constant Data from BindingDB
Found 1 hit for monomerid = 50065686
TargetcGMP-specific 3',5'-cyclic phosphodiesterase(Canis lupus familiaris)
Mitsubishi Tanabe Pharma
Curated by ChEMBL
LigandPNGBDBM50065686(CHEMBL3404006)
Affinity DataIC50:  0.980nM. Assay description: Inhibition of canine lung PDE5 using [3H]cGMP incubated for 30 mins by scintillation analysis
In DepthDetails ArticlePubMed