BDBM50065720 CHEMBL3400229
SMILES CC[C@H](C)[C@H](N)CN(C(=O)[C@@H]1C[C@H]1c1cncnc1)c1ccc(cc1)-c1ccccc1
InChI Key InChIKey=DBHOJBZLKPYDKH-URPHZZJISA-N
Data  1 EC50
  Tab Delimited (TSV)   2D SDfile   Computed 3D by Vconf -m prep SDfile
Find this compound or compounds like it in BindingDB:
Activity Spreadsheet -- Enzyme Inhibition Constant Data from BindingDB
Found 1 hit for monomerid = 50065720
TargetProbable G-protein coupled receptor 88(Homo sapiens (Human))
Lexicon Pharmaceuticals
Curated by ChEMBL
LigandPNGBDBM50065720(CHEMBL3400229)
Affinity DataEC50:  1.90E+4nM. Assay description: Agonist activity at GPR88 (unknown origin) transfected into cells assessed as cAMP accumulation by HTRF assay
In DepthDetails ArticlePubMed