BDBM50065842 CHEMBL540048::N-(4-{[3-(1-Imino-ethyl)-benzylamino]-methyl}-phenyl)-acetamidine
SMILES CC(N)=Nc1ccc(CNCc2cccc(c2)C(C)=N)cc1
InChI Key InChIKey=WFWLBXDZFGNSPG-UHFFFAOYSA-N
Data  3 KI
  Tab Delimited (TSV)   2D SDfile   Computed 3D by Vconf -m prep SDfile
Find this compound or compounds like it in BindingDB:
Activity Spreadsheet -- Enzyme Inhibition Constant Data from BindingDB
Found 3 hits for monomerid = 50065842
TargetNitric oxide synthase, brain(Homo sapiens (Human))
Glaxo Wellcome Research And Development
Curated by ChEMBL
LigandPNGBDBM50065842(CHEMBL540048 | N-(4-{[3-(1-Imino-ethyl)-benzylamin...)
Affinity DataKi:  42nM. Assay description: Inhibitory activity against human neuronal nitric oxide synthase (nNOS) isoenzyme.
In DepthDetails ArticlePubMed
TargetNitric oxide synthase, inducible(Homo sapiens (Human))
Glaxo Wellcome Research And Development
Curated by ChEMBL
LigandPNGBDBM50065842(CHEMBL540048 | N-(4-{[3-(1-Imino-ethyl)-benzylamin...)
Affinity DataKi:  1.60E+3nM. Assay description: Inhibitory activity against human inducible nitric oxide synthase (iNOS) isoenzyme.
In DepthDetails ArticlePubMed
TargetNitric oxide synthase, endothelial(Homo sapiens (Human))
Glaxo Wellcome Research And Development
Curated by ChEMBL
LigandPNGBDBM50065842(CHEMBL540048 | N-(4-{[3-(1-Imino-ethyl)-benzylamin...)
Affinity DataKi:  3.00E+3nM. Assay description: Inhibitory activity against human endothelial nitric oxide synthase (eNOS) isoenzyme.
In DepthDetails ArticlePubMed