BDBM50065899 (2S,3S)-2-Benzyl-3-methylsulfanyl-4-oxo-azetidine-1-carboxylic acid (pyridin-4-ylmethyl)-amide::CHEMBL95260
SMILES CS[C@H]1[C@H](Cc2ccccc2)N(C(=O)NCc2ccncc2)C1=O
InChI Key InChIKey=QKWOVFQEKXZOQF-HOTGVXAUSA-N
Data  2 IC50
  Tab Delimited (TSV)   2D SDfile   Computed 3D by Vconf -m prep SDfile
Find this compound or compounds like it in BindingDB:
Activity Spreadsheet -- Enzyme Inhibition Constant Data from BindingDB
Found 2 hits for monomerid = 50065899
TargetChymotrypsinogen A(Bos taurus (bovine))
Boehringer Ingelheim (Canada)
Curated by ChEMBL
LigandPNGBDBM50065899((2S,3S)-2-Benzyl-3-methylsulfanyl-4-oxo-azetidine-...)
Affinity DataIC50:  2.20E+3nM. Assay description: Compound was tested for its activity against bovine pancreatic Alpha-chymotrypsin (BPC)
In DepthDetails ArticlePubMed
TargetGenome polyprotein(Human rhinovirus B)
Boehringer Ingelheim (Canada)
Curated by ChEMBL
LigandPNGBDBM50065899((2S,3S)-2-Benzyl-3-methylsulfanyl-4-oxo-azetidine-...)
Affinity DataIC50:  6.90E+3nM. Assay description: Inhibitory activity against human cytomegalovirus (HCMV) protease
In DepthDetails ArticlePubMed