BDBM50065934 2,2,2-Trifluoro-N-hydroxy-N-phenyl-acetamide::CHEMBL319073
SMILES ON(C(=O)C(F)(F)F)c1ccccc1
InChI Key InChIKey=NQUCPZLKPQFTEO-UHFFFAOYSA-N
Data  1 IC50
  Tab Delimited (TSV)   2D SDfile   Computed 3D by Vconf -m prep SDfile
Find this compound or compounds like it in BindingDB:
Activity Spreadsheet -- Enzyme Inhibition Constant Data from BindingDB
Found 1 hit for monomerid = 50065934
TargetAldehyde dehydrogenase 1A1(Rattus norvegicus)
St. Cloud State University
Curated by ChEMBL
LigandPNGBDBM50065934(2,2,2-Trifluoro-N-hydroxy-N-phenyl-acetamide | CHE...)
Affinity DataIC50: >1.00E+6nM. Assay description: Inhibitory activity of the compound against yeast aldehyde dehydrogenase(AIDH)
In DepthDetails ArticlePubMed