BDBM50065966 (S)-2-[(5-Chloro-1H-indole-2-carbonyl)-amino]-3-phenyl-propionic acid::CHEMBL431463
SMILES OC(=O)[C@H](Cc1ccccc1)NC(=O)c1cc2cc(Cl)ccc2[nH]1
InChI Key InChIKey=MDBPHOPIZCPCRE-INIZCTEOSA-N
Data  2 IC50
  Tab Delimited (TSV)   2D SDfile   Computed 3D by Vconf -m prep SDfile
Find this compound or compounds like it in BindingDB:
Activity Spreadsheet -- Enzyme Inhibition Constant Data from BindingDB
Found 2 hits for monomerid = 50065966
TargetLanosterol 14-alpha demethylase(Homo sapiens (Human))
Act
Curated by ChEMBL
LigandPNGBDBM50065966((S)-2-[(5-Chloro-1H-indole-2-carbonyl)-amino]-3-ph...)
Affinity DataIC50: >2.00E+5nM. Assay description: Inhibition of human CYP51 expressed in Topp 3 cells by lanosterol demethylase assay
In DepthDetails ArticlePubMed
TargetGlycogen phosphorylase, liver form(Homo sapiens (Human))
Pfizer
Curated by ChEMBL
LigandPNGBDBM50065966((S)-2-[(5-Chloro-1H-indole-2-carbonyl)-amino]-3-ph...)
Affinity DataIC50:  1.70E+3nM. Assay description: In vitro inhibitory activity against recombinant human liver glycogen phosphorylase a (rHLGPa) catalyzed release of phosphate from glucose-1-phosphat...
In DepthDetails ArticlePubMed