BDBM50066495 CHEMBL113816::N*6*-(3,5-Dimethoxy-benzyl)-N*6*-methyl-quinazoline-2,4,6-triamine
SMILES COc1cc(CN(C)c2ccc3nc(N)nc(N)c3c2)cc(OC)c1
InChI Key InChIKey=KPUKMCAOBYZDQE-UHFFFAOYSA-N
Data  10 IC50
  Tab Delimited (TSV)   2D SDfile   Computed 3D by Vconf -m prep SDfile
Find this compound or compounds like it in BindingDB:
Activity Spreadsheet -- Enzyme Inhibition Constant Data from BindingDB
Found 10 hits for monomerid = 50066495
TargetDihydrofolate reductase(Lactobacillus casei)
Duquesne University
Curated by ChEMBL
LigandPNGBDBM50066495(CHEMBL113816 | N*6*-(3,5-Dimethoxy-benzyl)-N*6*-me...)
Affinity DataIC50:  37nM. Assay description: Inhibitory activity against Dihydrofolate reductase from Lactobacillus casei ( lcDHFR)
In DepthDetails ArticlePubMed
TargetDihydrofolate reductase(Pneumocystis carinii)
Duquesne University
Curated by ChEMBL
LigandPNGBDBM50066495(CHEMBL113816 | N*6*-(3,5-Dimethoxy-benzyl)-N*6*-me...)
Affinity DataIC50:  24nM. Assay description: Inhibitory activity against Dihydrofolate reductase from Pneumocystis carinii (pcDHFR)
In DepthDetails ArticlePubMed
TargetBifunctional dihydrofolate reductase-thymidylate synthase(Toxoplasma gondii)
Duquesne University
Curated by ChEMBL
LigandPNGBDBM50066495(CHEMBL113816 | N*6*-(3,5-Dimethoxy-benzyl)-N*6*-me...)
Affinity DataIC50:  4.70nM. Assay description: Inhibition of recombinant Dihydrofolate reductase from Toxoplasma gondii (tgDHFR)
In DepthDetails ArticlePubMed
TargetDihydrofolate reductase(Escherichia coli)
Duquesne University
Curated by ChEMBL
LigandPNGBDBM50066495(CHEMBL113816 | N*6*-(3,5-Dimethoxy-benzyl)-N*6*-me...)
Affinity DataIC50:  2.80nM. Assay description: Inhibitory activity against recombinant Dihydrofolate reductase from Escherichia coli (ecDHFR)
In DepthDetails ArticlePubMed
TargetDihydrofolate reductase(Rattus norvegicus (rat))
Duquesne University
Curated by ChEMBL
LigandPNGBDBM50066495(CHEMBL113816 | N*6*-(3,5-Dimethoxy-benzyl)-N*6*-me...)
Affinity DataIC50:  8.20nM. Assay description: Inhibition of rat liver dihydrofolate reductase
In DepthDetails ArticlePubMed
TargetDihydrofolate reductase(Homo sapiens (Human))
Duquesne University
Curated by ChEMBL
LigandPNGBDBM50066495(CHEMBL113816 | N*6*-(3,5-Dimethoxy-benzyl)-N*6*-me...)
Affinity DataIC50:  11nM. Assay description: Inhibitory activity against Dihydrofolate reductase from recombinant human (hDHFR)
In DepthDetails ArticlePubMed
TargetBifunctional dihydrofolate reductase-thymidylate synthase(Toxoplasma gondii)
Duquesne University
Curated by ChEMBL
LigandPNGBDBM50066495(CHEMBL113816 | N*6*-(3,5-Dimethoxy-benzyl)-N*6*-me...)
Affinity DataIC50:  4.70nM. Assay description: Inhibition of recombinant Dihydrofolate reductase from Toxoplasma gondii (tgDHFR)
In DepthDetails ArticlePubMed
TargetDihydrofolate reductase(Pneumocystis carinii)
Duquesne University
Curated by ChEMBL
LigandPNGBDBM50066495(CHEMBL113816 | N*6*-(3,5-Dimethoxy-benzyl)-N*6*-me...)
Affinity DataIC50:  23.8nM. Assay description: Inhibition of Pneumocystis carinii dihydrofolate reductase
In DepthDetails ArticlePubMed
TargetBifunctional dihydrofolate reductase-thymidylate synthase(Toxoplasma gondii)
Duquesne University
Curated by ChEMBL
LigandPNGBDBM50066495(CHEMBL113816 | N*6*-(3,5-Dimethoxy-benzyl)-N*6*-me...)
Affinity DataIC50:  9.30nM. Assay description: Inhibition of Toxoplasma gondii dihydrofolate reductase
In DepthDetails ArticlePubMed
TargetDihydrofolate reductase(Rattus norvegicus (rat))
Duquesne University
Curated by ChEMBL
LigandPNGBDBM50066495(CHEMBL113816 | N*6*-(3,5-Dimethoxy-benzyl)-N*6*-me...)
Affinity DataIC50:  8.20nM. Assay description: Inhibitory activity against Dihydrofolate reductase from rat liver (rlDHFR)
In DepthDetails ArticlePubMed