BDBM50066503 CHEMBL3401575
SMILES Cc1ccc(cc1)S(=O)(=O)c1sc2ncccc2c1-c1ccc(Cl)cc1
InChI Key InChIKey=PPBWTESUIGOEGY-UHFFFAOYSA-N
Data  2 KI
  Tab Delimited (TSV)   2D SDfile   Computed 3D by Vconf -m prep SDfile
Find this compound or compounds like it in BindingDB:
Activity Spreadsheet -- Enzyme Inhibition Constant Data from BindingDB
Found 2 hits for monomerid = 50066503
TargetMetabotropic glutamate receptor 5(Rattus norvegicus (Rat))
Gedeon Richter
Curated by ChEMBL
LigandPNGBDBM50066503(CHEMBL3401575)
Affinity DataKi:  15nM. Assay description: Displacement of [3H]MPEP from rat mGlu5 receptor expressed in rat cerebrocortical membrane measured after 1 hr
In DepthDetails ArticlePubMed
TargetMetabotropic glutamate receptor 5(Rattus norvegicus (Rat))
Gedeon Richter
Curated by ChEMBL
LigandPNGBDBM50066503(CHEMBL3401575)
Affinity DataKi:  15nM. Assay description: Displacement of [3H]-M-MPEP from rat cerebrocortical mGluR5 receptor
In DepthDetails ArticlePubMed