BDBM50066582 5-Cyclopentyl-3-(4-trifluoromethyl-phenylamino)-1H-pyrazole-4-carbonitrile::CHEMBL118489
SMILES FC(F)(F)c1ccc(Nc2[nH]nc(C3CCCC3)c2C#N)cc1
InChI Key InChIKey=NXRYQCUIWXFJHK-UHFFFAOYSA-N
Data  1 IC50
  Tab Delimited (TSV)   2D SDfile   Computed 3D by Vconf -m prep SDfile
Find this compound or compounds like it in BindingDB:
Activity Spreadsheet -- Enzyme Inhibition Constant Data from BindingDB
Found 1 hit for monomerid = 50066582
TargetDihydroorotate dehydrogenase (quinone), mitochondrial(Homo sapiens (Human))
Novartis Pharma
Curated by ChEMBL
LigandPNGBDBM50066582(5-Cyclopentyl-3-(4-trifluoromethyl-phenylamino)-1H...)
Affinity DataIC50: >5.00E+4nM. Assay description: In vitro inhibitory activity against human dihydroorotate dehydrogenase (DHODH)
In DepthDetails ArticlePubMed