BDBM50066658 (R)-N-(1-(hydroxyamino)-2-methylpropyl)-4-methoxy-N-(pyridin-3-ylmethyl)benzenesulfonamide hydrochloride::(R)-N-Hydroxy-2-[(4-methoxy-benzenesulfonyl)-pyridin-3-ylmethyl-amino]-3-methyl-butyramide::(R)-N-Hydroxy-2-[(4-methoxy-benzenesulfonyl)-pyridin-3-ylmethyl-amino]-3-methyl-butyramide; hydrochloride::(R)-N-Hydroxy-2-isopropyl-3-(4-methoxy-benzenesulfonyl)-4-pyridin-3-yl-butyramide; hydrochloride::(R)-N-hydroxy-2-(4-methoxy-N-(pyridin-3-ylmethyl)phenylsulfonamido)-3-methylbutanamide::(S)-N-Hydroxy-2-[(4-methoxy-benzenesulfonyl)-pyridin-3-ylmethyl-amino]-3-methyl-butyramide::(S)-N-hydroxy-2-(4-methoxy-N-(pyridin-3-ylmethyl)phenylsulfonamido)-3-methylbutanamide::2-[Benzyl-(4-methoxy-benzenesulfonyl)-amino]-N-hydroxy-3-methyl-butyramide(CGS-27023A)::3-[((R)-1-Hydroxycarbamoyl-2-methyl-propylamino)-methyl]-pyridine-4-sulfonic acid methyl ester::CGS-27023::CGS-27023A::CHEMBL514138::N-Hydroxy-2-[(4-methoxy-benzenesulfonyl)-pyridin-3-ylmethyl-amino]-3-methyl-butyramide::N-hydroxy-2(R)-[[(4-methoxyphenyl)sulfonyl](3-picolyl)-amino]-3-methyl-butanamide
SMILES COc1ccc(cc1)S(=O)(=O)N(Cc1cccnc1)[C@H](C(C)C)C(=O)NO
InChI Key InChIKey=BSIZUMJRKYHEBR-QGZVFWFLSA-N
Data  7 IC50
PDB links: 4 PDB IDs match this monomer.
  Tab Delimited (TSV)   2D SDfile   Computed 3D by Vconf -m prep SDfile
Find this compound or compounds like it in BindingDB:
Activity Spreadsheet -- Enzyme Inhibition Constant Data from BindingDB
Found 7 hits for monomerid = 50066658
TargetMatrix metalloproteinase-9(Homo sapiens (Human))
Instituto Superior TéCnico
Curated by ChEMBL
LigandPNGBDBM50066658((R)-N-(1-(hydroxyamino)-2-methylpropyl)-4-methoxy-...)
Affinity DataIC50:  5nM. Assay description: Inhibition of MMP9
In DepthDetails ArticlePubMed
TargetMatrix metalloproteinase-14(Homo sapiens (Human))
Instituto Superior TéCnico
Curated by ChEMBL
LigandPNGBDBM50066658((R)-N-(1-(hydroxyamino)-2-methylpropyl)-4-methoxy-...)
Affinity DataIC50:  23nM. Assay description: Inhibition of MMP14
In DepthDetails ArticlePubMed
TargetInterstitial collagenase(Homo sapiens (Human))
Instituto Superior TéCnico
Curated by ChEMBL
LigandPNGBDBM50066658((R)-N-(1-(hydroxyamino)-2-methylpropyl)-4-methoxy-...)
Affinity DataIC50:  56nM. Assay description: Inhibition of MMP1
TargetMatrix metalloproteinase-16(Homo sapiens (Human))
Instituto Superior TéCnico
Curated by ChEMBL
LigandPNGBDBM50066658((R)-N-(1-(hydroxyamino)-2-methylpropyl)-4-methoxy-...)
Affinity DataIC50:  6.80nM. Assay description: Inhibition of MMP16
In DepthDetails ArticlePubMed
TargetNeutrophil collagenase(Homo sapiens (Human))
Instituto Superior TéCnico
Curated by ChEMBL
LigandPNGBDBM50066658((R)-N-(1-(hydroxyamino)-2-methylpropyl)-4-methoxy-...)
Affinity DataIC50:  7.70nM. Assay description: Inhibition of MMP8
In DepthDetails ArticlePubMed
TargetCollagenase 3(Homo sapiens (Human))
Instituto Superior TéCnico
Curated by ChEMBL
LigandPNGBDBM50066658((R)-N-(1-(hydroxyamino)-2-methylpropyl)-4-methoxy-...)
Affinity DataIC50:  5.5nM. Assay description: Inhibition of MMP13
In DepthDetails ArticlePubMed
Target72 kDa type IV collagenase(Homo sapiens (Human))
Instituto Superior TéCnico
Curated by ChEMBL
LigandPNGBDBM50066658((R)-N-(1-(hydroxyamino)-2-methylpropyl)-4-methoxy-...)
Affinity DataIC50:  25nM. Assay description: Inhibition of human recombinant MMP2 transfected in mouse melanoma cells
In DepthDetails ArticlePubMed