BDBM50066860 CHEMBL3401648
SMILES [Br-].OC(C(=O)N[C@H]1C[N+]2(CCCc3ccccc3)CCC1CC2)(c1cccs1)c1cccs1
InChI Key InChIKey=CFPVEUFKLQKJRS-QICJACQXSA-O
Data  3 IC50
  Tab Delimited (TSV)   2D SDfile   Computed 3D by Vconf -m prep SDfile
Find this compound or compounds like it in BindingDB:
Activity Spreadsheet -- Enzyme Inhibition Constant Data from BindingDB
Found 3 hits for monomerid = 50066860
TargetMuscarinic acetylcholine receptor M1(Homo sapiens (Human))
RhôNe-Poulenc Rorer
Curated by ChEMBL
LigandPNGBDBM50066860(CHEMBL3401648)
Affinity DataIC50:  1nM. Assay description: Displacement of [3H]NMS from human M1 receptor expressed in CHOK1 cell membranes after 4 hrs by scintillation counting method
In DepthDetails ArticlePubMed
TargetMuscarinic acetylcholine receptor M3(Homo sapiens (Human))
RhôNe-Poulenc Rorer
Curated by ChEMBL
LigandPNGBDBM50066860(CHEMBL3401648)
Affinity DataIC50:  0.700nM. Assay description: Displacement of [3H]NMS from human M3 receptor expressed in CHOK1 cell membranes after 4 hrs by scintillation counting method
In DepthDetails ArticlePubMed
TargetMuscarinic acetylcholine receptor M2(Homo sapiens (Human))
RhôNe-Poulenc Rorer
Curated by ChEMBL
LigandPNGBDBM50066860(CHEMBL3401648)
Affinity DataIC50:  0.600nM. Assay description: Displacement of [3H]NMS from human M2 receptor expressed in CHOK1 cell membranes after 4 hrs by scintillation counting method
In DepthDetails ArticlePubMed