BDBM50067225 CHEMBL3400598
SMILES Cl.O=C1CCCN1CCCCN1CCN(CC1)C(c1ccccc1)c1ccccc1
InChI Key InChIKey=PYQWCYJZAOTKAE-UHFFFAOYSA-N
Data  1 EC50
  Tab Delimited (TSV)   2D SDfile   Computed 3D by Vconf -m prep SDfile
Find this compound or compounds like it in BindingDB:
Activity Spreadsheet -- Enzyme Inhibition Constant Data from BindingDB
Found 1 hit for monomerid = 50067225
TargetAlpha-1B adrenergic receptor(Homo sapiens (Human))
Jagiellonian University Medical College
Curated by ChEMBL
LigandPNGBDBM50067225(CHEMBL3400598)
Affinity DataEC50:  289nM. Assay description: Antagonist activity at alpha-1B adrenergic receptor (unknown origin) incubated for 30 mins prior to agonist addition measured after 5 hrs by CCF4-AM ...
In DepthDetails ArticlePubMed