BDBM50067258 (E)-N-({[3-(3-Bromo-2-methyl-imidazo[1,2-a]pyridin-8-yloxymethyl)-2,4-dichloro-phenyl]-methyl-carbamoyl}-methyl)-3-[4-(3-methyl-ureido)-phenyl]-acrylamide; hydrochloride::CHEMBL555555
SMILES CNC(=O)Nc1ccc(\C=C\C(=O)NCC(=O)N(C)c2ccc(Cl)c(COc3cccn4c(Br)c(C)nc34)c2Cl)cc1
InChI Key InChIKey=JJUGCNDPURDBCS-MDWZMJQESA-N
Data  2 IC50
  Tab Delimited (TSV)   2D SDfile   Computed 3D by Vconf -m prep SDfile
Find this compound or compounds like it in BindingDB:
Activity Spreadsheet -- Enzyme Inhibition Constant Data from BindingDB
Found 2 hits for monomerid = 50067258
TargetB2 bradykinin receptor(Homo sapiens (Human))
Fujisawa Pharmaceutical
Curated by ChEMBL
LigandPNGBDBM50067258((E)-N-({[3-(3-Bromo-2-methyl-imidazo[1,2-a]pyridin...)
Affinity DataIC50:  2.60nM. Assay description: Concentration required to inhibit specific binding of [3H]BK at 1.2 nM to A-431 cells (human epidermoidcarcinoma) which express Bradykinin receptor B...
In DepthDetails ArticlePubMed
TargetB2 bradykinin receptor(Cavia porcellus)
Fujisawa Pharmaceutical
Curated by ChEMBL
LigandPNGBDBM50067258((E)-N-({[3-(3-Bromo-2-methyl-imidazo[1,2-a]pyridin...)
Affinity DataIC50:  0.890nM. Assay description: Concentration required to inhibit specific binding of [3H]BK at 0.06 nM to Bradykinin receptor B2 in guinea pig ileum membrane preparations by 50%.
In DepthDetails ArticlePubMed