BDBM50067290 5-{2-[({[2,4-Dichloro-3-(2-methyl-quinolin-8-yloxymethyl)-phenyl]-methyl-carbamoyl}-methyl)-carbamoyl]-vinyl}-pyridine-2-carboxylic acid methylamide; dihydrochloride::CHEMBL542232
SMILES CNC(=O)c1ccc(\C=C\C(=O)NCC(=O)N(C)c2ccc(Cl)c(COc3cccc4ccc(C)nc34)c2Cl)cn1
InChI Key InChIKey=XDXCCLNKCOVRHK-NTEUORMPSA-N
Data  3 IC50
  Tab Delimited (TSV)   2D SDfile   Computed 3D by Vconf -m prep SDfile
Find this compound or compounds like it in BindingDB:
Activity Spreadsheet -- Enzyme Inhibition Constant Data from BindingDB
Found 3 hits for monomerid = 50067290
TargetB2 bradykinin receptor(Cavia porcellus)
Fujisawa Pharmaceutical
Curated by ChEMBL
LigandPNGBDBM50067290(5-{2-[({[2,4-Dichloro-3-(2-methyl-quinolin-8-yloxy...)
Affinity DataIC50:  0.680nM. Assay description: Concentration required to inhibit specific binding of [ 3H]BK (0.06 nM) to Bradykinin receptor B2 in guinea pig ileum membrane preparations by 50%.
In DepthDetails ArticlePubMed
TargetB2 bradykinin receptor(Cavia porcellus)
Fujisawa Pharmaceutical
Curated by ChEMBL
LigandPNGBDBM50067290(5-{2-[({[2,4-Dichloro-3-(2-methyl-quinolin-8-yloxy...)
Affinity DataIC50:  0.460nM. Assay description: Displacement of [3H]BK from Bradykinin B2 Receptor in guinea pig ileum by liquid scintillation counter
In DepthDetails ArticlePubMed
TargetB2 bradykinin receptor(Homo sapiens (Human))
Fujisawa Pharmaceutical
Curated by ChEMBL
LigandPNGBDBM50067290(5-{2-[({[2,4-Dichloro-3-(2-methyl-quinolin-8-yloxy...)
Affinity DataIC50:  0.680nM. Assay description: Concentration required to inhibit specific binding of [ 3H]BK (0.06 nM) to Bradykinin receptor B2 in guinea pig ileum membrane preparations by 50%.
In DepthDetails ArticlePubMed