BDBM50067294 4-{2-[({[2,4-Dichloro-3-(2-methyl-quinolin-8-yloxymethyl)-phenyl]-methyl-carbamoyl}-methyl)-carbamoyl]-vinyl}-N-pyridin-3-yl-benzamide; dihydrochloride::CHEMBL540819
SMILES CN(C(=O)CNC(=O)\C=C\c1ccc(cc1)C(=O)Nc1cccnc1)c1ccc(Cl)c(COc2cccc3ccc(C)nc23)c1Cl
InChI Key InChIKey=ICLAQYJFGDWFQD-GZTJUZNOSA-N
Data  2 IC50
  Tab Delimited (TSV)   2D SDfile   Computed 3D by Vconf -m prep SDfile
Find this compound or compounds like it in BindingDB:
Activity Spreadsheet -- Enzyme Inhibition Constant Data from BindingDB
Found 2 hits for monomerid = 50067294
TargetB2 bradykinin receptor(Homo sapiens (Human))
Fujisawa Pharmaceutical
Curated by ChEMBL
LigandPNGBDBM50067294(4-{2-[({[2,4-Dichloro-3-(2-methyl-quinolin-8-yloxy...)
Affinity DataIC50:  7.5nM. Assay description: Inhibition specific binding of [3H]BK (1.0 nM) to human Bradykinin receptor B2 which was expressed in CHO (Chinese hamster ovary) cells by 50%.
In DepthDetails ArticlePubMed
TargetB2 bradykinin receptor(Cavia porcellus)
Fujisawa Pharmaceutical
Curated by ChEMBL
LigandPNGBDBM50067294(4-{2-[({[2,4-Dichloro-3-(2-methyl-quinolin-8-yloxy...)
Affinity DataIC50:  0.620nM. Assay description: Concentration required to inhibit specific binding of [ 3H]BK (0.06 nM) to Bradykinin receptor B2 in guinea pig ileum membrane preparations by 50%.
In DepthDetails ArticlePubMed