BDBM50067506 CHEMBL3401898
SMILES FC(F)(F)c1cc(NC(=O)CCN2CCCCC2)c2SSSSSc2c1
InChI Key InChIKey=KZNUWWXFXUZTCP-UHFFFAOYSA-N
Data  1 IC50
  Tab Delimited (TSV)   2D SDfile   Computed 3D by Vconf -m prep SDfile
Find this compound or compounds like it in BindingDB:
Activity Spreadsheet -- Enzyme Inhibition Constant Data from BindingDB
Found 1 hit for monomerid = 50067506
TargetTyrosyl-DNA phosphodiesterase 1(Homo sapiens (Human))
Siberian Branch Of The Russian Academy Of Sciences
Curated by ChEMBL
LigandPNGBDBM50067506(CHEMBL3401898)
Affinity DataIC50:  3.66E+3nM. Assay description: Inhibition of recombinant TDP1 (unknown origin) assessed as increase in fluorescence
In DepthDetails ArticlePubMed