BDBM50067545 CHEMBL3402048
SMILES CC(C)C[C@H](NC(=O)[C@H](CCC(N)=O)NC(=O)[C@H](CCCCN)NC(=O)[C@H](CCCNC(N)=N)NC(=O)[C@@H]1CCCN1C(=O)[C@H](C)NC(=O)[C@H](CCCCN)NC(=O)CNC(=O)CNC(=O)[C@@H](NC(=O)[C@H](CO)NC(=O)[C@H](CCCCN)NC(=O)[C@H](CCCNC(N)=N)NC(=O)[C@H](C)NC(=O)[C@@H](NC(=O)[C@H](CCC(N)=O)NC(=O)[C@H](CCCCN1CCC=CC1)NC(=O)[C@@H](NC(=O)[C@H](CCCNC(N)=N)NC(=O)[C@@H](C)N)[C@H](C)O)[C@H](C)O)[C@H](C)O)C(=O)N[C@@H](C)C(O)=O
InChI Key InChIKey=WFJKFXKVDBBRRM-SDODRVGOSA-N
Data  3 IC50
  Tab Delimited (TSV)   2D SDfile   Computed 3D by Vconf -m prep SDfile
Find this compound or compounds like it in BindingDB:
Activity Spreadsheet -- Enzyme Inhibition Constant Data from BindingDB
Found 3 hits for monomerid = 50067545
TargetLysine-specific histone demethylase 1A(Homo sapiens (Human))
Waseda University
Curated by ChEMBL
LigandPNGBDBM50067545(CHEMBL3402048)
Affinity DataIC50:  1.10E+4nM. Assay description: Inhibition of human recombinant LSD1 assessed as effect on H2O2 production incubated for 30 mins using methylated peptide substrate, Amplex red reage...
In DepthDetails ArticlePubMed
TargetAmine oxidase [flavin-containing] B(Homo sapiens (Human))
Waseda University
Curated by ChEMBL
LigandPNGBDBM50067545(CHEMBL3402048)
Affinity DataIC50: >1.00E+5nM. Assay description: Inhibition of human MAOB using (4S)-4,5-dihydro-2-(6-hydroxybenzothiazolyl)-4-thiazolecarboxylic acid substrate incubated for 60 mins by luciferin de...
In DepthDetails ArticlePubMed
TargetAmine oxidase [flavin-containing] A(Homo sapiens (Human))
Waseda University
Curated by ChEMBL
LigandPNGBDBM50067545(CHEMBL3402048)
Affinity DataIC50: >1.00E+5nM. Assay description: Inhibition of human MAOA using (4S)-4,5-dihydro-2-(6-hydroxybenzothiazolyl)-4-thiazolecarboxylic acid substrate incubated for 60 mins by luciferin de...
In DepthDetails ArticlePubMed