BDBM50067554 4-Methylcarbamoyl-4-[(R)-3-(3,4,5-trihydroxy-6-methyl-tetrahydro-pyran-2-yloxy)-2-(2-undecyl-tridecanoylamino)-propionylamino]-butyric acid::CHEMBL335065
SMILES CCCCCCCCCCCC(CCCCCCCCCCC)C(=O)N[C@H](COC1OC(C)C(O)C(O)C1O)C(=O)NC(CCC(O)=O)C(=O)NC
InChI Key InChIKey=GFDMQHXPBJZJBM-UTNIOZLDSA-N
Data  3 IC50
  Tab Delimited (TSV)   2D SDfile   Computed 3D by Vconf -m prep SDfile
Find this compound or compounds like it in BindingDB:
Activity Spreadsheet -- Enzyme Inhibition Constant Data from BindingDB
Found 3 hits for monomerid = 50067554
TargetP-selectin(Homo sapiens (Human))
Kanebo
Curated by ChEMBL
LigandPNGBDBM50067554(4-Methylcarbamoyl-4-[(R)-3-(3,4,5-trihydroxy-6-met...)
Affinity DataIC50:  1.50E+4nM. Assay description: Inhibition of Selectin P binding
In DepthDetails ArticlePubMed
TargetL-selectin(Homo sapiens (Human))
Kanebo
Curated by ChEMBL
LigandPNGBDBM50067554(4-Methylcarbamoyl-4-[(R)-3-(3,4,5-trihydroxy-6-met...)
Affinity DataIC50:  1.20E+4nM. Assay description: Inhibition of Selectin L binding
In DepthDetails ArticlePubMed
TargetE-selectin(Homo sapiens (Human))
Kanebo
Curated by ChEMBL
LigandPNGBDBM50067554(4-Methylcarbamoyl-4-[(R)-3-(3,4,5-trihydroxy-6-met...)
Affinity DataIC50:  1.60E+5nM. Assay description: Displacement of sialyl Lewis X (sLex) from selectin E
In DepthDetails ArticlePubMed