BDBM50067556 (S)-4-Methylcarbamoyl-4-[(R)-2-(2-tetradecyl-hexadecanoylamino)-3-(3,4,5-trihydroxy-6-methyl-tetrahydro-pyran-2-yloxy)-propionylamino]-butyric acid methyl ester::CHEMBL337229
SMILES CCCCCCCCCCCCCCC(CCCCCCCCCCCCCC)C(=O)N[C@H](COC1OC(C)C(O)C(O)C1O)C(=O)N[C@@H](CCC(=O)OC)C(=O)NC
InChI Key InChIKey=YZYMKLFOYJECDC-MVTHNEGNSA-N
Data  3 IC50
  Tab Delimited (TSV)   2D SDfile   Computed 3D by Vconf -m prep SDfile
Find this compound or compounds like it in BindingDB:
Activity Spreadsheet -- Enzyme Inhibition Constant Data from BindingDB
Found 3 hits for monomerid = 50067556
TargetP-selectin(Homo sapiens (Human))
Kanebo
Curated by ChEMBL
LigandPNGBDBM50067556((S)-4-Methylcarbamoyl-4-[(R)-2-(2-tetradecyl-hexad...)
Affinity DataIC50:  3.70E+4nM. Assay description: Inhibition of Selectin P binding
In DepthDetails ArticlePubMed
TargetE-selectin(Homo sapiens (Human))
Kanebo
Curated by ChEMBL
LigandPNGBDBM50067556((S)-4-Methylcarbamoyl-4-[(R)-2-(2-tetradecyl-hexad...)
Affinity DataIC50: >5.00E+5nM. Assay description: Displacement of sialyl Lewis X (sLex) from selectin E
In DepthDetails ArticlePubMed
TargetL-selectin(Homo sapiens (Human))
Kanebo
Curated by ChEMBL
LigandPNGBDBM50067556((S)-4-Methylcarbamoyl-4-[(R)-2-(2-tetradecyl-hexad...)
Affinity DataIC50: >5.00E+5nM. Assay description: Inhibition of Selectin L binding
In DepthDetails ArticlePubMed