BDBM50067598 CHEMBL3400724
SMILES CC(C)CN(C[C@@H](O)[C@H](Cc1ccccc1)NC(=O)CN(CC(=O)N1CCOCC1)c1c(C)cccc1C)S(=O)(=O)c1ccc(CO)cc1
InChI Key InChIKey=YOTVFNWGUZMWKO-SZAHLOSFSA-N
Data  1 IC50
  Tab Delimited (TSV)   2D SDfile   Computed 3D by Vconf -m prep SDfile
Find this compound or compounds like it in BindingDB:
Activity Spreadsheet -- Enzyme Inhibition Constant Data from BindingDB
Found 1 hit for monomerid = 50067598
TargetProtease(Human immunodeficiency virus 1 (HIV-1))
Chinese Academy Of Medical Sciences And Peking Union Medical College
Curated by ChEMBL
LigandPNGBDBM50067598(CHEMBL3400724)
Affinity DataIC50:  73nMT: 2°C. Assay description: Inhibition of HIV1 protease expressed in Escherichia coli incubated for 20 to 30 mins at room temperature using (Arg-Glu(EDANS)-Ser-Gln-Asn-Tyr-Pro-I...
In DepthDetails ArticlePubMed