BDBM50067627 3-(3-Amino-propyl)-2-(3,5-di-tert-butyl-4-hydroxy-phenyl)-thiazolidin-4-one::CHEMBL137426
SMILES CC(C)(C)c1cc(cc(c1O)C(C)(C)C)C1SCC(=O)N1CCCN
InChI Key InChIKey=DBMKWYMGBCJOLZ-UHFFFAOYSA-N
Data  1 IC50
  Tab Delimited (TSV)   2D SDfile   Computed 3D by Vconf -m prep SDfile
Find this compound or compounds like it in BindingDB:
Activity Spreadsheet -- Enzyme Inhibition Constant Data from BindingDB
Found 1 hit for monomerid = 50067627
TargetVoltage-dependent L-type calcium channel subunit alpha-1C(RAT)
Chugai Pharmaceutical
Curated by ChEMBL
LigandPNGBDBM50067627(3-(3-Amino-propyl)-2-(3,5-di-tert-butyl-4-hydroxy-...)
Affinity DataIC50:  4.40E+3nM. Assay description: In vitro inhibition of K+ induced contractions of the isolated rat aorta.
In DepthDetails ArticlePubMed