BDBM50067664 CHEMBL3400705
SMILES COc1ccc(cc1)N(CC(=O)N[C@@H](Cc1ccccc1)[C@H](O)CN(CC(C)C)S(=O)(=O)c1ccc(OC)cc1)CC(=O)N1CCOCC1
InChI Key InChIKey=RFMYXUUQHBKOTQ-SZAHLOSFSA-N
Data  1 IC50
  Tab Delimited (TSV)   2D SDfile   Computed 3D by Vconf -m prep SDfile
Find this compound or compounds like it in BindingDB:
Activity Spreadsheet -- Enzyme Inhibition Constant Data from BindingDB
Found 1 hit for monomerid = 50067664
TargetProtease(Human immunodeficiency virus 1 (HIV-1))
Chinese Academy Of Medical Sciences And Peking Union Medical College
Curated by ChEMBL
LigandPNGBDBM50067664(CHEMBL3400705)
Affinity DataIC50:  290nMT: 2°C. Assay description: Inhibition of HIV1 protease expressed in Escherichia coli incubated for 20 to 30 mins at room temperature using (Arg-Glu(EDANS)-Ser-Gln-Asn-Tyr-Pro-I...
In DepthDetails ArticlePubMed