BDBM50068071 CHEMBL2370908::SRIF
SMILES [H][C@]1(NC(=O)[C@@H](N)CCCCNC(=O)[C@@H](Cc2c[nH]c3ccccc23)NC(=O)[C@H](Cc2ccccc2)NC(=O)[C@@H](Cc2ccccc2)NC(=O)[C@H](CC(N)=O)NC(=O)[C@@H](CCCCN)NC(=O)[C@@H](CSSC[C@H](NC(=O)[C@H](CO)NC(=O)[C@@]([H])(NC(=O)[C@H](Cc2ccccc2)NC1=O)[C@@H](C)O)C(O)=O)NC(=O)CNC(=O)[C@H](C)N)[C@@H](C)O
InChI Key InChIKey=CQDPKTDIUBNHDF-QBIYFVOFSA-N
Data  2 KI
  Tab Delimited (TSV)   2D SDfile   Computed 3D by Vconf -m prep SDfile
Find this compound or compounds like it in BindingDB:
Activity Spreadsheet -- Enzyme Inhibition Constant Data from BindingDB
Found 2 hits for monomerid = 50068071
TargetSomatostatin receptor type 2(Homo sapiens (Human))
Northeast Louisiana University
Curated by ChEMBL
LigandPNGBDBM50068071(CHEMBL2370908 | SRIF)
Affinity DataKi:  0.200nM. Assay description: In vitro binding affinity at somatostatin 2 receptor in transfected HEK 293 cell using [125 I]Tyr11-SRIF-14 as radioligand
In DepthDetails ArticlePubMed
TargetSomatostatin receptor type 4(Homo sapiens (Human))
Northeast Louisiana University
Curated by ChEMBL
LigandPNGBDBM50068071(CHEMBL2370908 | SRIF)
Affinity DataKi:  1.40nM. Assay description: In vitro binding affinity at somatostatin receptor 4 in transfected BHK cells using [125 I]Tyr11-SRIF-14 as radioligand
In DepthDetails ArticlePubMed