BDBM50068080 CHEMBL142615::{5-[1-Naphthalen-2-yl-meth-(Z)-ylidene]-4-oxo-2-thioxo-thiazolidin-3-yl}-acetic acid
SMILES OC(=O)CN1C(=S)S\C(=C/c2ccc3ccccc3c2)C1=O
InChI Key InChIKey=HSUGOEFDHKSPDR-JYRVWZFOSA-N
Data  1 IC50
  Tab Delimited (TSV)   2D SDfile   Computed 3D by Vconf -m prep SDfile
Find this compound or compounds like it in BindingDB:
Activity Spreadsheet -- Enzyme Inhibition Constant Data from BindingDB
Found 1 hit for monomerid = 50068080
TargetAldo-keto reductase family 1 member B1 [K65Q](Bos taurus (Cattle))
Ep811-Cnrs
Curated by ChEMBL
LigandPNGBDBM50068080(CHEMBL142615 | {5-[1-Naphthalen-2-yl-meth-(Z)-ylid...)
Affinity DataIC50:  96nM. Assay description: Evaluated in vitro for the inhibition of Aldose reductase.
In DepthDetails ArticlePubMed