BDBM50068136 3-[(4-Benzyl-piperazin-1-yl)-phenyl-methyl]-phenol::CHEMBL356587
SMILES Oc1cccc(c1)C(N1CCN(Cc2ccccc2)CC1)c1ccccc1
InChI Key InChIKey=HZZCYHBEEHSRRI-UHFFFAOYSA-N
Data  2 IC50  2 EC50
  Tab Delimited (TSV)   2D SDfile   Computed 3D by Vconf -m prep SDfile
Find this compound or compounds like it in BindingDB:
Activity Spreadsheet -- Enzyme Inhibition Constant Data from BindingDB
Found 4 hits for monomerid = 50068136
TargetMu-type opioid receptor(GUINEA PIG)
The University Of Arizona
Curated by ChEMBL
LigandPNGBDBM50068136(3-[(4-Benzyl-piperazin-1-yl)-phenyl-methyl]-phenol...)
Affinity DataEC50:  1.25E+3nM. Assay description: Tested for electrically induced smooth muscle contractions from guinea pig ileum expressed in mu opioid receptors
In DepthDetails ArticlePubMed
TargetDelta-type opioid receptor(MOUSE)
The University Of Arizona
Curated by ChEMBL
LigandPNGBDBM50068136(3-[(4-Benzyl-piperazin-1-yl)-phenyl-methyl]-phenol...)
Affinity DataEC50:  174nM. Assay description: Tested for electrically induced smooth muscle contractions from mouse vas deferens expressed in delta opioid receptors
In DepthDetails ArticlePubMed
TargetMu-type opioid receptor(Rattus norvegicus (rat))
The University Of Arizona
Curated by ChEMBL
LigandPNGBDBM50068136(3-[(4-Benzyl-piperazin-1-yl)-phenyl-methyl]-phenol...)
Affinity DataIC50:  500nM. Assay description: Binding affinity was measured against Opioid receptor mu 1 using [3H]-DAMGO as radioligand.
In DepthDetails ArticlePubMed
TargetDelta-type opioid receptor(Rattus norvegicus (rat))
The University Of Arizona
Curated by ChEMBL
LigandPNGBDBM50068136(3-[(4-Benzyl-piperazin-1-yl)-phenyl-methyl]-phenol...)
Affinity DataIC50:  34nM. Assay description: Binding affinity was measured against Opioid receptor delta 1 using [3H]-p-Cl-DPDPE as radioligand.
In DepthDetails ArticlePubMed