BDBM50068161 Acetic acid 2-[((E)-hept-2-enyl)sulfanyl]-phenyl ester::CHEMBL356794
SMILES CCCC\C=C\CSc1ccccc1OC(C)=O
InChI Key InChIKey=PATGJLPVLHHXBZ-RMKNXTFCSA-N
Data  2 IC50
  Tab Delimited (TSV)   2D SDfile   Computed 3D by Vconf -m prep SDfile
Find this compound or compounds like it in BindingDB:
Activity Spreadsheet -- Enzyme Inhibition Constant Data from BindingDB
Found 2 hits for monomerid = 50068161
TargetProstaglandin G/H synthase 1(Ovis aries (Sheep))
Center In Molecular Toxicology And The Vanderbilt Cancer Center
Curated by ChEMBL
LigandPNGBDBM50068161(Acetic acid 2-[((E)-hept-2-enyl)sulfanyl]-phenyl e...)
Affinity DataIC50:  2.20E+4nM. Assay description: Inhibitory concentration in DMSO with purified ovine Prostaglandin G/H synthase 1 (COX-1).
In DepthDetails ArticlePubMed
TargetProstaglandin G/H synthase 2(Homo sapiens (Human))
Center In Molecular Toxicology And The Vanderbilt Cancer Center
Curated by ChEMBL
LigandPNGBDBM50068161(Acetic acid 2-[((E)-hept-2-enyl)sulfanyl]-phenyl e...)
Affinity DataIC50:  1.10E+4nM. Assay description: Inhibitory concentration in DMSO with purified human Prostaglandin G/H synthase 2 (COX-2)
In DepthDetails ArticlePubMed