BDBM50068174 Acetic acid 2-pent-2-ynylsulfanyl-phenyl ester::CHEMBL145727
SMILES CCC#CCSc1ccccc1OC(C)=O
InChI Key InChIKey=YSURFXWLBHUJCR-UHFFFAOYSA-N
Data  2 IC50
  Tab Delimited (TSV)   2D SDfile   Computed 3D by Vconf -m prep SDfile
Find this compound or compounds like it in BindingDB:
Activity Spreadsheet -- Enzyme Inhibition Constant Data from BindingDB
Found 2 hits for monomerid = 50068174
TargetProstaglandin G/H synthase 2(Homo sapiens (Human))
Center In Molecular Toxicology And The Vanderbilt Cancer Center
Curated by ChEMBL
LigandPNGBDBM50068174(Acetic acid 2-pent-2-ynylsulfanyl-phenyl ester | C...)
Affinity DataIC50:  5.00E+3nM. Assay description: Inhibitory concentration in DMSO with purified human Prostaglandin G/H synthase 2 (COX-2)
In DepthDetails ArticlePubMed
TargetProstaglandin G/H synthase 1(Ovis aries (Sheep))
Center In Molecular Toxicology And The Vanderbilt Cancer Center
Curated by ChEMBL
LigandPNGBDBM50068174(Acetic acid 2-pent-2-ynylsulfanyl-phenyl ester | C...)
Affinity DataIC50:  2.00E+4nM. Assay description: Inhibitory concentration in DMSO with purified ovine Prostaglandin G/H synthase 1 (COX-1).
In DepthDetails ArticlePubMed