BDBM50068237 CHEMBL3403331
SMILES Cc1ccc(cc1)S(=O)(=O)c1nc(sc1Cl)N1CCc2ccccc2C1
InChI Key InChIKey=SMUDPLMWQILIOO-UHFFFAOYSA-N
Data  4 KI
  Tab Delimited (TSV)   2D SDfile   Computed 3D by Vconf -m prep SDfile
Find this compound or compounds like it in BindingDB:
Activity Spreadsheet -- Enzyme Inhibition Constant Data from BindingDB
Found 4 hits for monomerid = 50068237
Target5-hydroxytryptamine receptor 6(Homo sapiens (Human))
Jagiellonian University
Curated by ChEMBL
LigandPNGBDBM50068237(CHEMBL3403331)
Affinity DataKi:  1.17E+3nM. Assay description: Displacement of [3H]LSD from human cloned 5-HT6R expressed in HEK293 cells at 0.1 and 1 uM
In DepthDetails ArticlePubMed
Target5-hydroxytryptamine receptor 1A(Homo sapiens (Human))
Jagiellonian University
Curated by ChEMBL
LigandPNGBDBM50068237(CHEMBL3403331)
Affinity DataKi:  4.59E+3nM. Assay description: Displacement of [3H]-8-OH-DPAT from human cloned 5-HT1A receptor expressed in HEK293 cells at 0.1 and 1 uM
In DepthDetails ArticlePubMed
Target5-hydroxytryptamine receptor 2A(Homo sapiens (Human))
Jagiellonian University
Curated by ChEMBL
LigandPNGBDBM50068237(CHEMBL3403331)
Affinity DataKi:  5.19E+3nM. Assay description: Displacement of [3H]-ketanserin from human cloned 5-HT2A receptor expressed in CHO-K1 cells at 0.1 and 1 uM
In DepthDetails ArticlePubMed
Target5-hydroxytryptamine receptor 7(Homo sapiens (Human))
Jagiellonian University
Curated by ChEMBL
LigandPNGBDBM50068237(CHEMBL3403331)
Affinity DataKi:  6.37E+3nM. Assay description: Displacement of [3H]-5-CT from human cloned 5-HT7R expressed in HEK293 cells at 0.1 and 1 uM
In DepthDetails ArticlePubMed