BDBM50068537 CHEMBL3403454::US9598440, 31
SMILES Cc1cc(Nc2ncc(-c3nc4ccccc4s3)c(N[C@@H]3C[C@H](CO)[C@@H](O)[C@H]3O)n2)ccn1
InChI Key InChIKey=SZKNNBPYGFYJDN-HSGBFHSBSA-N
Data  2 IC50
  Tab Delimited (TSV)   2D SDfile   Computed 3D by Vconf -m prep SDfile
Find this compound or compounds like it in BindingDB:
Activity Spreadsheet -- Enzyme Inhibition Constant Data from BindingDB
Found 2 hits for monomerid = 50068537
TargetInterleukin-1 receptor-associated kinase 4(Homo sapiens (Human))
Merck Sharp & Dohme
US Patent
LigandPNGBDBM50068537(CHEMBL3403454 | US9598440, 31)
Affinity DataIC50:  1.20nM. Assay description: Procedure: A 20 μl reaction mixture contains 10 mM TriHCl, pH 7.2, 0.5 nM GST tagged IRAK4 (SignalChem), 100 nM fluorescent peptide substrate (R...
In DepthDetails US Patent
TargetInterleukin-1 receptor-associated kinase 4(Homo sapiens (Human))
Merck Sharp & Dohme
US Patent
LigandPNGBDBM50068537(CHEMBL3403454 | US9598440, 31)
Affinity DataIC50:  1.00E+3nM. Assay description: Inhibition of N-terminal GST tagged human recombinant full-length IRAK4 expressed in Sf9 insect cells assessed as reduction in substrate phosphorylat...
In DepthDetails ArticlePubMed